{"text_format":"1","workbook":"xlsx","n_sheets":3,"sheets":["Worksheet","SYSTEM FORMULAE","System DO NOT OPEN"],"not_rendered":{"charts":0,"images":0,"macros":1,"external_links":0,"defined_names":8,"comments":0,"pivot_tables":0},"unopened":[],"bounds":{"document_bytes":16777216,"sheet_cells":100000,"rows_first":2000,"rows_last":500,"rows_between":2000,"halvings":0,"cell_chars":16384,"cell_head_chars":4096},"cells_cut":0,"cells_raw":0,"read":"whole","date_system":"1900"}

{"sheet":"Worksheet","index":0,"n_rows":22,"n_cols":11,"rows_kept":22,"cut":false,"hidden":false,"merged":[[0,5,0,6],[1,5,1,6],[0,0,0,3]]}
["Variables"]
[null,null,null,null,null,"National 5 Maths: Non-calculator practice",null,"Answers  (this column does not print by default)"]
[null,null,null,{"$f":"IF(K3=1,\"Easier\",IF(K3=2,\"Harder\",\"Harder\"))","v":"Easier"},null,1,"20 + 12 × 16","212",null,null,1]
[null,null,null,{"$f":"IF(K4=1,\"Easier\",IF(K4=2,\"Harder\",\"Harder\"))","v":"Easier"},null,2,"180 – 80 – 75","25",null,null,1]
[null,null,null,"Easier",null,3,"11 × 82","902",null,null,1]
[null,null,null,"Easier",null,4,"Divide:           105 ÷ 30","3.5",null,null,1]
[null,null,null,"Easier",null,5,"5.88 × 30","176.4",null,null,1]
[null,null,null,"Easier",null,6,"What is 2 to the power of 4 ?","16",null,null,1]
[null,null,null,"Easier",null,7,"9049.4 × 100","904940",null,null,1]
[null,null,null,"Easier",null,8,"90% of 37000","33300",null,null,1]
[null,null,null,"Easier",null,9,"Divide:           -7200 ÷ 40","90",null,null,1]
[null,null,null,"Easier",null,10,"0.9 × 4800","4320",null,null,1]
[null,null,null,"Harder",null,11,"use the gradient formula with the coordinates:    (10 , -8) and (2 , 9)","-17/8",null,null,2]
[null,null,null,"Harder",null,12,"7.5 × 56 + 10","430",null,null,2]
[null,null,null,"Harder",null,13,"15% of £790","£118.50",null,null,2]
{"$rows_left_out":8}
{"sheet":"SYSTEM FORMULAE","index":1,"n_rows":20,"n_cols":21,"rows_kept":20,"cut":false,"hidden":false,"merged":[]}
[{"$f":"Worksheet!D3","v":"Easier"},{"$f":"IF($A1=\"Easier\",RANDBETWEEN(1,Easy),IF($A1=\"Harder\",RANDBETWEEN(Easy+1,Easy+Medium),IF($A1=\"Harder\",RANDBETWEEN(Easy+Medium+1,Easy+Medium+Hard),RANDBETWEEN(1,Easy+Medium+Hard))))","v":29},{"$f":"IF(COUNTIF(B$1:B1,B1)<>1,IF($A1=\"Easier\",RANDBETWEEN(1,Easy),IF($A1=\"Harder\",RANDBETWEEN(Easy+1,Easy+Medium),IF($A1=\"Harder\",RANDBETWEEN(Easy+Medium+1,Easy+Medium+Hard),RANDBETWEEN(1,Easy+Medium+Hard)))),B1)","v":29},{"$f":"IF(COUNTIF(C$1:C1,C1)<>1,IF($A1=\"Easier\",RANDBETWEEN(1,Easy),IF($A1=\"Harder\",RANDBETWEEN(Easy+1,Easy+Medium),IF($A1=\"Harder\",RANDBETWEEN(Easy+Medium+1,Easy+Medium+Hard),RANDBETWEEN(1,Easy+Medium+Hard)))),C1)","v":29},{"$f":"IF(COUNTIF(D$1:D1,D1)<>1,IF($A1=\"Easier\",RANDBETWEEN(1,Easy),IF($A1=\"Harder\",RANDBETWEEN(Easy+1,Easy+Medium),IF($A1=\"Harder\",RANDBETWEEN(Easy+Medium+1,Easy+Medium+Hard),RANDBETWEEN(1,Easy+Medium+Hard)))),D1)","v":29},{"$f":"IF(COUNTIF(E$1:E1,E1)<>1,IF($A1=\"Easier\",RANDBETWEEN(1,Easy),IF($A1=\"Harder\",RANDBETWEEN(Easy+1,Easy+Medium),IF($A1=\"Harder\",RANDBETWEEN(Easy+Medium+1,Easy+Medium+Hard),RANDBETWEEN(1,Easy+Medium+Hard)))),E1)","v":29},1,{"$f":"VLOOKUP($F1,'System DO NOT OPEN'!$A$8:$P$188,11)","v":"Divide:           315 ÷ 50"},{"$f":"VLOOKUP($F1,'System DO NOT OPEN'!$A$8:$P$188,16)","v":"6.3"},null,null,null,null,null,null,null,null,null,null,null,"shading shapes"]
[{"$f":"Worksheet!D4","v":"Easier"},16,{"$f":"IF(COUNTIF(B$1:B2,B2)<>1,IF($A2=\"Easier\",RANDBETWEEN(1,Easy),IF($A2=\"Harder\",RANDBETWEEN(Easy+1,Easy+Medium),IF($A2=\"Harder\",RANDBETWEEN(Easy+Medium+1,Easy+Medium+Hard),RANDBETWEEN(1,Easy+Medium+Hard)))),B2)","v":16},{"$f":"IF(COUNTIF(C$1:C2,C2)<>1,IF($A2=\"Easier\",RANDBETWEEN(1,Easy),IF($A2=\"Harder\",RANDBETWEEN(Easy+1,Easy+Medium),IF($A2=\"Harder\",RANDBETWEEN(Easy+Medium+1,Easy+Medium+Hard),RANDBETWEEN(1,Easy+Medium+Hard)))),C2)","v":16},{"$f":"IF(COUNTIF(D$1:D2,D2)<>1,IF($A2=\"Easier\",RANDBETWEEN(1,Easy),IF($A2=\"Harder\",RANDBETWEEN(Easy+1,Easy+Medium),IF($A2=\"Harder\",RANDBETWEEN(Easy+Medium+1,Easy+Medium+Hard),RANDBETWEEN(1,Easy+Medium+Hard)))),D2)","v":16},{"$f":"IF(COUNTIF(E$1:E2,E2)<>1,IF($A2=\"Easier\",RANDBETWEEN(1,Easy),IF($A2=\"Harder\",RANDBETWEEN(Easy+1,Easy+Medium),IF($A2=\"Harder\",RANDBETWEEN(Easy+Medium+1,Easy+Medium+Hard),RANDBETWEEN(1,Easy+Medium+Hard)))),E2)","v":16},2,{"$f":"VLOOKUP($F2,'System DO NOT OPEN'!$A$8:$P$188,11)","v":"What is 5 to the power of 4 ?"},{"$f":"VLOOKUP($F2,'System DO NOT OPEN'!$A$8:$P$188,16)","v":"625"},null,null,null,null,null,null,null,null,null,null,null,"how many 4p grapes for 28p"]
[{"$f":"Worksheet!D5","v":"Easier"},11,{"$f":"IF(COUNTIF(B$1:B3,B3)<>1,IF($A3=\"Easier\",RANDBETWEEN(1,Easy),IF($A3=\"Harder\",RANDBETWEEN(Easy+1,Easy+Medium),IF($A3=\"Harder\",RANDBETWEEN(Easy+Medium+1,Easy+Medium+Hard),RANDBETWEEN(1,Easy+Medium+Hard)))),B3)","v":11},{"$f":"IF(COUNTIF(C$1:C3,C3)<>1,IF($A3=\"Easier\",RANDBETWEEN(1,Easy),IF($A3=\"Harder\",RANDBETWEEN(Easy+1,Easy+Medium),IF($A3=\"Harder\",RANDBETWEEN(Easy+Medium+1,Easy+Medium+Hard),RANDBETWEEN(1,Easy+Medium+Hard)))),C3)","v":11},{"$f":"IF(COUNTIF(D$1:D3,D3)<>1,IF($A3=\"Easier\",RANDBETWEEN(1,Easy),IF($A3=\"Harder\",RANDBETWEEN(Easy+1,Easy+Medium),IF($A3=\"Harder\",RANDBETWEEN(Easy+Medium+1,Easy+Medium+Hard),RANDBETWEEN(1,Easy+Medium+Hard)))),D3)","v":11},{"$f":"IF(COUNTIF(E$1:E3,E3)<>1,IF($A3=\"Easier\",RANDBETWEEN(1,Easy),IF($A3=\"Harder\",RANDBETWEEN(Easy+1,Easy+Medium),IF($A3=\"Harder\",RANDBETWEEN(Easy+Medium+1,Easy+Medium+Hard),RANDBETWEEN(1,Easy+Medium+Hard)))),E3)","v":11},3,{"$f":"VLOOKUP($F3,'System DO NOT OPEN'!$A$8:$P$188,11)","v":"5% of 1760"},{"$f":"VLOOKUP($F3,'System DO NOT OPEN'!$A$8:$P$188,16)","v":"88"},null,null,null,null,null,null,null,null,null,null,null,"what do 9 pencils cost at 10p each"]
[{"$f":"Worksheet!D6","v":"Easier"},13,{"$f":"IF(COUNTIF(B$1:B4,B4)<>1,IF($A4=\"Easier\",RANDBETWEEN(1,Easy),IF($A4=\"Harder\",RANDBETWEEN(Easy+1,Easy+Medium),IF($A4=\"Harder\",RANDBETWEEN(Easy+Medium+1,Easy+Medium+Hard),RANDBETWEEN(1,Easy+Medium+Hard)))),B4)","v":13},{"$f":"IF(COUNTIF(C$1:C4,C4)<>1,IF($A4=\"Easier\",RANDBETWEEN(1,Easy),IF($A4=\"Harder\",RANDBETWEEN(Easy+1,Easy+Medium),IF($A4=\"Harder\",RANDBETWEEN(Easy+Medium+1,Easy+Medium+Hard),RANDBETWEEN(1,Easy+Medium+Hard)))),C4)","v":13},{"$f":"IF(COUNTIF(D$1:D4,D4)<>1,IF($A4=\"Easier\",RANDBETWEEN(1,Easy),IF($A4=\"Harder\",RANDBETWEEN(Easy+1,Easy+Medium),IF($A4=\"Harder\",RANDBETWEEN(Easy+Medium+1,Easy+Medium+Hard),RANDBETWEEN(1,Easy+Medium+Hard)))),D4)","v":13},{"$f":"IF(COUNTIF(E$1:E4,E4)<>1,IF($A4=\"Easier\",RANDBETWEEN(1,Easy),IF($A4=\"Harder\",RANDBETWEEN(Easy+1,Easy+Medium),IF($A4=\"Harder\",RANDBETWEEN(Easy+Medium+1,Easy+Medium+Hard),RANDBETWEEN(1,Easy+Medium+Hard)))),E4)","v":13},4,{"$f":"VLOOKUP($F4,'System DO NOT OPEN'!$A$8:$P$188,11)","v":"What is the square root of 121?"},{"$f":"VLOOKUP($F4,'System DO NOT OPEN'!$A$8:$P$188,16)","v":"11"},null,null,null,null,null,null,null,null,null,null,null,"pounds/pence"]
[{"$f":"Worksheet!D7","v":"Easier"},35,{"$f":"IF(COUNTIF(B$1:B5,B5)<>1,IF($A5=\"Easier\",RANDBETWEEN(1,Easy),IF($A5=\"Harder\",RANDBETWEEN(Easy+1,Easy+Medium),IF($A5=\"Harder\",RANDBETWEEN(Easy+Medium+1,Easy+Medium+Hard),RANDBETWEEN(1,Easy+Medium+Hard)))),B5)","v":35},{"$f":"IF(COUNTIF(C$1:C5,C5)<>1,IF($A5=\"Easier\",RANDBETWEEN(1,Easy),IF($A5=\"Harder\",RANDBETWEEN(Easy+1,Easy+Medium),IF($A5=\"Harder\",RANDBETWEEN(Easy+Medium+1,Easy+Medium+Hard),RANDBETWEEN(1,Easy+Medium+Hard)))),C5)","v":35},{"$f":"IF(COUNTIF(D$1:D5,D5)<>1,IF($A5=\"Easier\",RANDBETWEEN(1,Easy),IF($A5=\"Harder\",RANDBETWEEN(Easy+1,Easy+Medium),IF($A5=\"Harder\",RANDBETWEEN(Easy+Medium+1,Easy+Medium+Hard),RANDBETWEEN(1,Easy+Medium+Hard)))),D5)","v":35},{"$f":"IF(COUNTIF(E$1:E5,E5)<>1,IF($A5=\"Easier\",RANDBETWEEN(1,Easy),IF($A5=\"Harder\",RANDBETWEEN(Easy+1,Easy+Medium),IF($A5=\"Harder\",RANDBETWEEN(Easy+Medium+1,Easy+Medium+Hard),RANDBETWEEN(1,Easy+Medium+Hard)))),E5)","v":35},5,{"$f":"VLOOKUP($F5,'System DO NOT OPEN'!$A$8:$P$188,11)","v":"0.6 × 5500"},{"$f":"VLOOKUP($F5,'System DO NOT OPEN'!$A$8:$P$188,16)","v":"3300"}]
[{"$f":"Worksheet!D8","v":"Easier"},23,{"$f":"IF(COUNTIF(B$1:B6,B6)<>1,IF($A6=\"Easier\",RANDBETWEEN(1,Easy),IF($A6=\"Harder\",RANDBETWEEN(Easy+1,Easy+Medium),IF($A6=\"Harder\",RANDBETWEEN(Easy+Medium+1,Easy+Medium+Hard),RANDBETWEEN(1,Easy+Medium+Hard)))),B6)","v":23},{"$f":"IF(COUNTIF(C$1:C6,C6)<>1,IF($A6=\"Easier\",RANDBETWEEN(1,Easy),IF($A6=\"Harder\",RANDBETWEEN(Easy+1,Easy+Medium),IF($A6=\"Harder\",RANDBETWEEN(Easy+Medium+1,Easy+Medium+Hard),RANDBETWEEN(1,Easy+Medium+Hard)))),C6)","v":23},{"$f":"IF(COUNTIF(D$1:D6,D6)<>1,IF($A6=\"Easier\",RANDBETWEEN(1,Easy),IF($A6=\"Harder\",RANDBETWEEN(Easy+1,Easy+Medium),IF($A6=\"Harder\",RANDBETWEEN(Easy+Medium+1,Easy+Medium+Hard),RANDBETWEEN(1,Easy+Medium+Hard)))),D6)","v":23},{"$f":"IF(COUNTIF(E$1:E6,E6)<>1,IF($A6=\"Easier\",RANDBETWEEN(1,Easy),IF($A6=\"Harder\",RANDBETWEEN(Easy+1,Easy+Medium),IF($A6=\"Harder\",RANDBETWEEN(Easy+Medium+1,Easy+Medium+Hard),RANDBETWEEN(1,Easy+Medium+Hard)))),E6)","v":23},6,{"$f":"VLOOKUP($F6,'System DO NOT OPEN'!$A$8:$P$188,11)","v":"£6786 × 6"},{"$f":"VLOOKUP($F6,'System DO NOT OPEN'!$A$8:$P$188,16)","v":"£40716"}]
[{"$f":"Worksheet!D9","v":"Easier"},10,{"$f":"IF(COUNTIF(B$1:B7,B7)<>1,IF($A7=\"Easier\",RANDBETWEEN(1,Easy),IF($A7=\"Harder\",RANDBETWEEN(Easy+1,Easy+Medium),IF($A7=\"Harder\",RANDBETWEEN(Easy+Medium+1,Easy+Medium+Hard),RANDBETWEEN(1,Easy+Medium+Hard)))),B7)","v":10},{"$f":"IF(COUNTIF(C$1:C7,C7)<>1,IF($A7=\"Easier\",RANDBETWEEN(1,Easy),IF($A7=\"Harder\",RANDBETWEEN(Easy+1,Easy+Medium),IF($A7=\"Harder\",RANDBETWEEN(Easy+Medium+1,Easy+Medium+Hard),RANDBETWEEN(1,Easy+Medium+Hard)))),C7)","v":10},{"$f":"IF(COUNTIF(D$1:D7,D7)<>1,IF($A7=\"Easier\",RANDBETWEEN(1,Easy),IF($A7=\"Harder\",RANDBETWEEN(Easy+1,Easy+Medium),IF($A7=\"Harder\",RANDBETWEEN(Easy+Medium+1,Easy+Medium+Hard),RANDBETWEEN(1,Easy+Medium+Hard)))),D7)","v":10},{"$f":"IF(COUNTIF(E$1:E7,E7)<>1,IF($A7=\"Easier\",RANDBETWEEN(1,Easy),IF($A7=\"Harder\",RANDBETWEEN(Easy+1,Easy+Medium),IF($A7=\"Harder\",RANDBETWEEN(Easy+Medium+1,Easy+Medium+Hard),RANDBETWEEN(1,Easy+Medium+Hard)))),E7)","v":10},7,{"$f":"VLOOKUP($F7,'System DO NOT OPEN'!$A$8:$P$188,11)","v":"Calculate:     4/5 of 4660"},{"$f":"VLOOKUP($F7,'System DO NOT OPEN'!$A$8:$P$188,16)","v":"3728"}]
[{"$f":"Worksheet!D10","v":"Easier"},7,{"$f":"IF(COUNTIF(B$1:B8,B8)<>1,IF($A8=\"Easier\",RANDBETWEEN(1,Easy),IF($A8=\"Harder\",RANDBETWEEN(Easy+1,Easy+Medium),IF($A8=\"Harder\",RANDBETWEEN(Easy+Medium+1,Easy+Medium+Hard),RANDBETWEEN(1,Easy+Medium+Hard)))),B8)","v":7},{"$f":"IF(COUNTIF(C$1:C8,C8)<>1,IF($A8=\"Easier\",RANDBETWEEN(1,Easy),IF($A8=\"Harder\",RANDBETWEEN(Easy+1,Easy+Medium),IF($A8=\"Harder\",RANDBETWEEN(Easy+Medium+1,Easy+Medium+Hard),RANDBETWEEN(1,Easy+Medium+Hard)))),C8)","v":7},{"$f":"IF(COUNTIF(D$1:D8,D8)<>1,IF($A8=\"Easier\",RANDBETWEEN(1,Easy),IF($A8=\"Harder\",RANDBETWEEN(Easy+1,Easy+Medium),IF($A8=\"Harder\",RANDBETWEEN(Easy+Medium+1,Easy+Medium+Hard),RANDBETWEEN(1,Easy+Medium+Hard)))),D8)","v":7},{"$f":"IF(COUNTIF(E$1:E8,E8)<>1,IF($A8=\"Easier\",RANDBETWEEN(1,Easy),IF($A8=\"Harder\",RANDBETWEEN(Easy+1,Easy+Medium),IF($A8=\"Harder\",RANDBETWEEN(Easy+Medium+1,Easy+Medium+Hard),RANDBETWEEN(1,Easy+Medium+Hard)))),E8)","v":7},8,{"$f":"VLOOKUP($F8,'System DO NOT OPEN'!$A$8:$P$188,11)","v":"5.56 × 80"},{"$f":"VLOOKUP($F8,'System DO NOT OPEN'!$A$8:$P$188,16)","v":"444.8"}]
[{"$f":"Worksheet!D11","v":"Easier"},3,{"$f":"IF(COUNTIF(B$1:B9,B9)<>1,IF($A9=\"Easier\",RANDBETWEEN(1,Easy),IF($A9=\"Harder\",RANDBETWEEN(Easy+1,Easy+Medium),IF($A9=\"Harder\",RANDBETWEEN(Easy+Medium+1,Easy+Medium+Hard),RANDBETWEEN(1,Easy+Medium+Hard)))),B9)","v":3},{"$f":"IF(COUNTIF(C$1:C9,C9)<>1,IF($A9=\"Easier\",RANDBETWEEN(1,Easy),IF($A9=\"Harder\",RANDBETWEEN(Easy+1,Easy+Medium),IF($A9=\"Harder\",RANDBETWEEN(Easy+Medium+1,Easy+Medium+Hard),RANDBETWEEN(1,Easy+Medium+Hard)))),C9)","v":3},{"$f":"IF(COUNTIF(D$1:D9,D9)<>1,IF($A9=\"Easier\",RANDBETWEEN(1,Easy),IF($A9=\"Harder\",RANDBETWEEN(Easy+1,Easy+Medium),IF($A9=\"Harder\",RANDBETWEEN(Easy+Medium+1,Easy+Medium+Hard),RANDBETWEEN(1,Easy+Medium+Hard)))),D9)","v":3},{"$f":"IF(COUNTIF(E$1:E9,E9)<>1,IF($A9=\"Easier\",RANDBETWEEN(1,Easy),IF($A9=\"Harder\",RANDBETWEEN(Easy+1,Easy+Medium),IF($A9=\"Harder\",RANDBETWEEN(Easy+Medium+1,Easy+Medium+Hard),RANDBETWEEN(1,Easy+Medium+Hard)))),E9)","v":3},9,{"$f":"VLOOKUP($F9,'System DO NOT OPEN'!$A$8:$P$188,11)","v":"80% of 3500"},{"$f":"VLOOKUP($F9,'System DO NOT OPEN'!$A$8:$P$188,16)","v":"2800"}]
[{"$f":"Worksheet!D12","v":"Easier"},6,{"$f":"IF(COUNTIF(B$1:B10,B10)<>1,IF($A10=\"Easier\",RANDBETWEEN(1,Easy),IF($A10=\"Harder\",RANDBETWEEN(Easy+1,Easy+Medium),IF($A10=\"Harder\",RANDBETWEEN(Easy+Medium+1,Easy+Medium+Hard),RANDBETWEEN(1,Easy+Medium+Hard)))),B10)","v":6},{"$f":"IF(COUNTIF(C$1:C10,C10)<>1,IF($A10=\"Easier\",RANDBETWEEN(1,Easy),IF($A10=\"Harder\",RANDBETWEEN(Easy+1,Easy+Medium),IF($A10=\"Harder\",RANDBETWEEN(Easy+Medium+1,Easy+Medium+Hard),RANDBETWEEN(1,Easy+Medium+Hard)))),C10)","v":6},{"$f":"IF(COUNTIF(D$1:D10,D10)<>1,IF($A10=\"Easier\",RANDBETWEEN(1,Easy),IF($A10=\"Harder\",RANDBETWEEN(Easy+1,Easy+Medium),IF($A10=\"Harder\",RANDBETWEEN(Easy+Medium+1,Easy+Medium+Hard),RANDBETWEEN(1,Easy+Medium+Hard)))),D10)","v":6},{"$f":"IF(COUNTIF(E$1:E10,E10)<>1,IF($A10=\"Easier\",RANDBETWEEN(1,Easy),IF($A10=\"Harder\",RANDBETWEEN(Easy+1,Easy+Medium),IF($A10=\"Harder\",RANDBETWEEN(Easy+Medium+1,Easy+Medium+Hard),RANDBETWEEN(1,Easy+Medium+Hard)))),E10)","v":6},10,{"$f":"VLOOKUP($F10,'System DO NOT OPEN'!$A$8:$P$188,11)","v":"5.58 × 20"},{"$f":"VLOOKUP($F10,'System DO NOT OPEN'!$A$8:$P$188,16)","v":"111.6"}]
[{"$f":"Worksheet!D13","v":"Harder"},68,{"$f":"IF(COUNTIF(B$1:B11,B11)<>1,IF($A11=\"Easier\",RANDBETWEEN(1,Easy),IF($A11=\"Harder\",RANDBETWEEN(Easy+1,Easy+Medium),IF($A11=\"Harder\",RANDBETWEEN(Easy+Medium+1,Easy+Medium+Hard),RANDBETWEEN(1,Easy+Medium+Hard)))),B11)","v":68},{"$f":"IF(COUNTIF(C$1:C11,C11)<>1,IF($A11=\"Easier\",RANDBETWEEN(1,Easy),IF($A11=\"Harder\",RANDBETWEEN(Easy+1,Easy+Medium),IF($A11=\"Harder\",RANDBETWEEN(Easy+Medium+1,Easy+Medium+Hard),RANDBETWEEN(1,Easy+Medium+Hard)))),C11)","v":68},{"$f":"IF(COUNTIF(D$1:D11,D11)<>1,IF($A11=\"Easier\",RANDBETWEEN(1,Easy),IF($A11=\"Harder\",RANDBETWEEN(Easy+1,Easy+Medium),IF($A11=\"Harder\",RANDBETWEEN(Easy+Medium+1,Easy+Medium+Hard),RANDBETWEEN(1,Easy+Medium+Hard)))),D11)","v":68},{"$f":"IF(COUNTIF(E$1:E11,E11)<>1,IF($A11=\"Easier\",RANDBETWEEN(1,Easy),IF($A11=\"Harder\",RANDBETWEEN(Easy+1,Easy+Medium),IF($A11=\"Harder\",RANDBETWEEN(Easy+Medium+1,Easy+Medium+Hard),RANDBETWEEN(1,Easy+Medium+Hard)))),E11)","v":68},11,{"$f":"VLOOKUP($F11,'System DO NOT OPEN'!$A$8:$P$188,11)","v":"1/2 × 18 × 20 × 1/4"},{"$f":"VLOOKUP($F11,'System DO NOT OPEN'!$A$8:$P$188,16)","v":"45"}]
[{"$f":"Worksheet!D14","v":"Harder"},60,{"$f":"IF(COUNTIF(B$1:B12,B12)<>1,IF($A12=\"Easier\",RANDBETWEEN(1,Easy),IF($A12=\"Harder\",RANDBETWEEN(Easy+1,Easy+Medium),IF($A12=\"Harder\",RANDBETWEEN(Easy+Medium+1,Easy+Medium+Hard),RANDBETWEEN(1,Easy+Medium+Hard)))),B12)","v":60},{"$f":"IF(COUNTIF(C$1:C12,C12)<>1,IF($A12=\"Easier\",RANDBETWEEN(1,Easy),IF($A12=\"Harder\",RANDBETWEEN(Easy+1,Easy+Medium),IF($A12=\"Harder\",RANDBETWEEN(Easy+Medium+1,Easy+Medium+Hard),RANDBETWEEN(1,Easy+Medium+Hard)))),C12)","v":60},{"$f":"IF(COUNTIF(D$1:D12,D12)<>1,IF($A12=\"Easier\",RANDBETWEEN(1,Easy),IF($A12=\"Harder\",RANDBETWEEN(Easy+1,Easy+Medium),IF($A12=\"Harder\",RANDBETWEEN(Easy+Medium+1,Easy+Medium+Hard),RANDBETWEEN(1,Easy+Medium+Hard)))),D12)","v":60},{"$f":"IF(COUNTIF(E$1:E12,E12)<>1,IF($A12=\"Easier\",RANDBETWEEN(1,Easy),IF($A12=\"Harder\",RANDBETWEEN(Easy+1,Easy+Medium),IF($A12=\"Harder\",RANDBETWEEN(Easy+Medium+1,Easy+Medium+Hard),RANDBETWEEN(1,Easy+Medium+Hard)))),E12)","v":60},12,{"$f":"VLOOKUP($F12,'System DO NOT OPEN'!$A$8:$P$188,11)","v":"4 to the power of 3/2"},{"$f":"VLOOKUP($F12,'System DO NOT OPEN'!$A$8:$P$188,16)","v":"8"}]
[{"$f":"Worksheet!D15","v":"Harder"},74,{"$f":"IF(COUNTIF(B$1:B13,B13)<>1,IF($A13=\"Easier\",RANDBETWEEN(1,Easy),IF($A13=\"Harder\",RANDBETWEEN(Easy+1,Easy+Medium),IF($A13=\"Harder\",RANDBETWEEN(Easy+Medium+1,Easy+Medium+Hard),RANDBETWEEN(1,Easy+Medium+Hard)))),B13)","v":74},{"$f":"IF(COUNTIF(C$1:C13,C13)<>1,IF($A13=\"Easier\",RANDBETWEEN(1,Easy),IF($A13=\"Harder\",RANDBETWEEN(Easy+1,Easy+Medium),IF($A13=\"Harder\",RANDBETWEEN(Easy+Medium+1,Easy+Medium+Hard),RANDBETWEEN(1,Easy+Medium+Hard)))),C13)","v":74},{"$f":"IF(COUNTIF(D$1:D13,D13)<>1,IF($A13=\"Easier\",RANDBETWEEN(1,Easy),IF($A13=\"Harder\",RANDBETWEEN(Easy+1,Easy+Medium),IF($A13=\"Harder\",RANDBETWEEN(Easy+Medium+1,Easy+Medium+Hard),RANDBETWEEN(1,Easy+Medium+Hard)))),D13)","v":74},{"$f":"IF(COUNTIF(E$1:E13,E13)<>1,IF($A13=\"Easier\",RANDBETWEEN(1,Easy),IF($A13=\"Harder\",RANDBETWEEN(Easy+1,Easy+Medium),IF($A13=\"Harder\",RANDBETWEEN(Easy+Medium+1,Easy+Medium+Hard),RANDBETWEEN(1,Easy+Medium+Hard)))),E13)","v":74},13,{"$f":"VLOOKUP($F13,'System DO NOT OPEN'!$A$8:$P$188,11)","v":"1/2 × 24 × 15 × 2/3"},{"$f":"VLOOKUP($F13,'System DO NOT OPEN'!$A$8:$P$188,16)","v":"120"}]
[{"$f":"Worksheet!D16","v":"Harder"},55,{"$f":"IF(COUNTIF(B$1:B14,B14)<>1,IF($A14=\"Easier\",RANDBETWEEN(1,Easy),IF($A14=\"Harder\",RANDBETWEEN(Easy+1,Easy+Medium),IF($A14=\"Harder\",RANDBETWEEN(Easy+Medium+1,Easy+Medium+Hard),RANDBETWEEN(1,Easy+Medium+Hard)))),B14)","v":55},{"$f":"IF(COUNTIF(C$1:C14,C14)<>1,IF($A14=\"Easier\",RANDBETWEEN(1,Easy),IF($A14=\"Harder\",RANDBETWEEN(Easy+1,Easy+Medium),IF($A14=\"Harder\",RANDBETWEEN(Easy+Medium+1,Easy+Medium+Hard),RANDBETWEEN(1,Easy+Medium+Hard)))),C14)","v":55},{"$f":"IF(COUNTIF(D$1:D14,D14)<>1,IF($A14=\"Easier\",RANDBETWEEN(1,Easy),IF($A14=\"Harder\",RANDBETWEEN(Easy+1,Easy+Medium),IF($A14=\"Harder\",RANDBETWEEN(Easy+Medium+1,Easy+Medium+Hard),RANDBETWEEN(1,Easy+Medium+Hard)))),D14)","v":55},{"$f":"IF(COUNTIF(E$1:E14,E14)<>1,IF($A14=\"Easier\",RANDBETWEEN(1,Easy),IF($A14=\"Harder\",RANDBETWEEN(Easy+1,Easy+Medium),IF($A14=\"Harder\",RANDBETWEEN(Easy+Medium+1,Easy+Medium+Hard),RANDBETWEEN(1,Easy+Medium+Hard)))),E14)","v":55},14,{"$f":"VLOOKUP($F14,'System DO NOT OPEN'!$A$8:$P$188,11)","v":"4² - 4 × 4 + 1"},{"$f":"VLOOKUP($F14,'System DO NOT OPEN'!$A$8:$P$188,16)","v":"1"}]
[{"$f":"Worksheet!D17","v":"Harder"},78,{"$f":"IF(COUNTIF(B$1:B15,B15)<>1,IF($A15=\"Easier\",RANDBETWEEN(1,Easy),IF($A15=\"Harder\",RANDBETWEEN(Easy+1,Easy+Medium),IF($A15=\"Harder\",RANDBETWEEN(Easy+Medium+1,Easy+Medium+Hard),RANDBETWEEN(1,Easy+Medium+Hard)))),B15)","v":78},{"$f":"IF(COUNTIF(C$1:C15,C15)<>1,IF($A15=\"Easier\",RANDBETWEEN(1,Easy),IF($A15=\"Harder\",RANDBETWEEN(Easy+1,Easy+Medium),IF($A15=\"Harder\",RANDBETWEEN(Easy+Medium+1,Easy+Medium+Hard),RANDBETWEEN(1,Easy+Medium+Hard)))),C15)","v":78},{"$f":"IF(COUNTIF(D$1:D15,D15)<>1,IF($A15=\"Easier\",RANDBETWEEN(1,Easy),IF($A15=\"Harder\",RANDBETWEEN(Easy+1,Easy+Medium),IF($A15=\"Harder\",RANDBETWEEN(Easy+Medium+1,Easy+Medium+Hard),RANDBETWEEN(1,Easy+Medium+Hard)))),D15)","v":78},{"$f":"IF(COUNTIF(E$1:E15,E15)<>1,IF($A15=\"Easier\",RANDBETWEEN(1,Easy),IF($A15=\"Harder\",RANDBETWEEN(Easy+1,Easy+Medium),IF($A15=\"Harder\",RANDBETWEEN(Easy+Medium+1,Easy+Medium+Hard),RANDBETWEEN(1,Easy+Medium+Hard)))),E15)","v":78},15,{"$f":"VLOOKUP($F15,'System DO NOT OPEN'!$A$8:$P$188,11)","v":"use the gradient formula with the coordinates:    (-9 , -10) and (1 , -3)"},{"$f":"VLOOKUP($F15,'System DO NOT OPEN'!$A$8:$P$188,16)","v":"7/10"}]
{"$rows_left_out":6}
{"sheet":"System DO NOT OPEN","index":2,"n_rows":98,"n_cols":16,"rows_kept":98,"cut":false,"hidden":false,"merged":[]}
["Must be sorted by column B"]
["Number of easy questions",{"$f":"COUNTIF(ABC,\"A\")","v":37},null,null,null,null,"A = basic skills"]
["Number of medium questions",{"$f":"COUNTIF(ABC,\"B\")","v":43},null,null,null,null,"B = routine"]
["Number of hard questions",{"$f":"COUNTIF(ABC,\"C\")","v":0}]
["TOTAL",{"$f":"COUNT(Numbers)","v":70}]
[null,{"$f":"B2+B3+B4=B5","v":false}]
["Question number","Difficulty",null,null,null,null,null,null,null,null,null,null,null,null,null,"Answer"]
[{"$f":"IF(ISBLANK(C8),\" \",ROW(B8)-7)","v":1},"A",{"$f":"CHOOSE(RANDBETWEEN(1,2),\"25%\",\"75%\")","v":"75%"}," of ",{"$f":"4*RANDBETWEEN(11,99)*10^RANDBETWEEN(1,3)","v":21200},null,null,null,null,null,{"$f":"CONCATENATE(\"\",C8,\"\",D8,\"\",E8,\"\",F8,\"\",G8,\"\",H8,\"\",I8,\"\",J8,\"\")","v":"75% of 21200"},{"$f":"IF(C8=\"25%\",E8/4,E8/4*3)","v":15900},null,null,null,{"$f":"CONCATENATE(\"\",L8,\"\",M8,\"\",N8,\"\",O8,\"\")","v":"15900"}]
[2,"A",{"$f":"RANDBETWEEN(2,4)*10","v":20},"% of ",{"$f":"10^RANDBETWEEN(1,3)*RANDBETWEEN(5,99)","v":850},null,null,null,null,null,"20% of 850",{"$f":"E9/100*C9","v":170},null,null,null,"170"]
[3,"A",{"$f":"RANDBETWEEN(6,9)*10","v":80},"% of ",{"$f":"10^RANDBETWEEN(1,3)*RANDBETWEEN(5,99)","v":3500},null,null,null,null,null,"80% of 3500",{"$f":"E10/100*C10","v":2800},null,null,null,"2800"]
[4,"A",{"$f":"RANDBETWEEN(101,99999)/10^RANDBETWEEN(1,4)","v":76.608000000000004}," × ",{"$f":"10^RANDBETWEEN(2,4)","v":10000},null,null,null,null,null,"76.608 × 10000",{"$f":"C11*E11","v":766080},null,null,null,"766080"]
[5,"A",{"$f":"RANDBETWEEN(101,99999)/10^RANDBETWEEN(1,5)","v":7543.2}," ÷ ",{"$f":"10^RANDBETWEEN(2,4)","v":10000},null,null,null,null,null,"7543.2 ÷ 10000",{"$f":"C12/E12","v":0.75431999999999999},null,null,null,"0.75432"]
[6,"A",{"$f":"(RANDBETWEEN(11,99)*10+RANDBETWEEN(1,9))/10^RANDBETWEEN(1,2)","v":5.58}," × ",{"$f":"RANDBETWEEN(2,9)*10","v":20},null,null,null,null,null,"5.58 × 20",{"$f":"C13*E13","v":111.6},null,null,null,"111.6"]
[7,"A",{"$f":"(RANDBETWEEN(11,99)*10+RANDBETWEEN(1,9))/10^RANDBETWEEN(1,2)","v":5.56}," × ",{"$f":"RANDBETWEEN(2,9)*10","v":80},null,null,null,null,null,"5.56 × 80",{"$f":"C14*E14","v":444.79999999999995},null,null,null,"444.8"]
[8,"A",{"$f":"RANDBETWEEN(1,3)*10+RANDBETWEEN(1,9)","v":25}," × ",{"$f":"RANDBETWEEN(1,9)*10+RANDBETWEEN(1,9)","v":75},null,null,null,null,null,"25 × 75",{"$f":"C15*E15","v":1875},null,null,null,"1875"]
{"$rows_left_out":83}