{"text_format":"1","workbook":"xlsx","n_sheets":3,"sheets":["Worksheet","SYSTEM FORMULAE","System DO NOT OPEN"],"not_rendered":{"charts":0,"images":0,"macros":1,"external_links":0,"defined_names":8,"comments":0,"pivot_tables":0},"unopened":[],"bounds":{"document_bytes":16777216,"sheet_cells":100000,"rows_first":2000,"rows_last":500,"rows_between":2000,"halvings":0,"cell_chars":16384,"cell_head_chars":4096},"cells_cut":0,"cells_raw":0,"read":"whole","date_system":"1900"}

{"sheet":"Worksheet","index":0,"n_rows":22,"n_cols":11,"rows_kept":22,"cut":false,"hidden":false,"merged":[[0,5,0,6],[1,5,1,6],[0,0,0,3],[0,8,1,14]]}
["Variables",null,null,null,null,null,null,null,"Questions described as Easiest correspond roughly to the most straightforward noncalculator skills required in an exam;  those described as Medium correspond roughly to the average standard of noncalculator skills found in past exam papers;   those described as Harder cover the most challenging skills that have arisen in exams, as well as other questions that go beyond the course syllabus and which can be used as extension for able pupils"]
[null,null,null,null,null,"National 5 Applications of Maths:                                                                non-calculator practice questions",null,"Answers  (this column does not print by default)"]
[null,null,null,{"$f":"IF(K3=1,\"Easiest\",IF(K3=2,\"Medium\",\"Harder\"))","v":"Easiest"},null,1,"Calculate:   £224.36 – £29 – £33","£162.36",null,null,1]
[null,null,null,{"$f":"IF(K4=1,\"Easiest\",IF(K4=2,\"Medium\",\"Harder\"))","v":"Easiest"},null,2,"Calculate 75% of 9600 miles","7200 miles",null,null,1]
[null,null,null,"Easiest",null,3,"Calculate:   £325 – £49.26 – £35.46","£240.28",null,null,1]
[null,null,null,"Easiest",null,4,"What temperature is 29°C lower than 14°C ?","-15°C",null,null,1]
[null,null,null,"Medium",null,5,"Express the fraction in its simplest form:           16/32","1/2",null,null,2]
[null,null,null,"Medium",null,6,"Calculate the mean:           £53.35,  £22.80,  £33.02,  £78.31,  £11.00","£39.70",null,null,2]
[null,null,null,"Medium",null,7,"Round    $6573.77  to 3 significant figures","$6570",null,null,2]
[null,null,null,"Medium",null,8,"Calculate the square root of    10² – 6²","8",null,null,2]
{"$rows_left_out":13}
{"sheet":"SYSTEM FORMULAE","index":1,"n_rows":20,"n_cols":9,"rows_kept":20,"cut":false,"hidden":false,"merged":[]}
[{"$f":"Worksheet!D3","v":"Easiest"},{"$f":"IF($A1=\"Easiest\",RANDBETWEEN(1,Easy),IF($A1=\"Harder\",RANDBETWEEN(Easy+1,Easy+Medium),IF($A1=\"Harder\",RANDBETWEEN(Easy+Medium+1,Easy+Medium+Hard),RANDBETWEEN(1,Easy+Medium+Hard))))","v":61},{"$f":"IF(COUNTIF(B$1:B1,B1)<>1,IF($A1=\"Easiest\",RANDBETWEEN(1,Easy),IF($A1=\"Medium\",RANDBETWEEN(Easy+1,Easy+Medium),IF($A1=\"Harder\",RANDBETWEEN(Easy+Medium+1,Easy+Medium+Hard),RANDBETWEEN(1,Easy+Medium+Hard)))),B1)","v":61},{"$f":"IF(COUNTIF(C$1:C1,C1)<>1,IF($A1=\"Easiest\",RANDBETWEEN(1,Easy),IF($A1=\"Medium\",RANDBETWEEN(Easy+1,Easy+Medium),IF($A1=\"Harder\",RANDBETWEEN(Easy+Medium+1,Easy+Medium+Hard),RANDBETWEEN(1,Easy+Medium+Hard)))),C1)","v":61},{"$f":"IF(COUNTIF(D$1:D1,D1)<>1,IF($A1=\"Easiest\",RANDBETWEEN(1,Easy),IF($A1=\"Medium\",RANDBETWEEN(Easy+1,Easy+Medium),IF($A1=\"Harder\",RANDBETWEEN(Easy+Medium+1,Easy+Medium+Hard),RANDBETWEEN(1,Easy+Medium+Hard)))),D1)","v":61},{"$f":"IF(COUNTIF(E$1:E1,E1)<>1,IF($A1=\"Easiest\",RANDBETWEEN(1,Easy),IF($A1=\"Medium\",RANDBETWEEN(Easy+1,Easy+Medium),IF($A1=\"Harder\",RANDBETWEEN(Easy+Medium+1,Easy+Medium+Hard),RANDBETWEEN(1,Easy+Medium+Hard)))),E1)","v":61},1,{"$f":"VLOOKUP($F1,'System DO NOT OPEN'!$A$8:$Q$400,12)","v":"Calculate 20% of 420"},{"$f":"VLOOKUP($F1,'System DO NOT OPEN'!$A$8:$Q$400,17)","v":"84"}]
[{"$f":"Worksheet!D4","v":"Easiest"},{"$f":"IF($A2=\"Easiest\",RANDBETWEEN(1,Easy),IF($A2=\"Medium\",RANDBETWEEN(Easy+1,Easy+Medium),IF($A2=\"Harder\",RANDBETWEEN(Easy+Medium+1,Easy+Medium+Hard),RANDBETWEEN(1,Easy+Medium+Hard))))","v":101},{"$f":"IF(COUNTIF(B$1:B2,B2)<>1,IF($A2=\"Easiest\",RANDBETWEEN(1,Easy),IF($A2=\"Medium\",RANDBETWEEN(Easy+1,Easy+Medium),IF($A2=\"Harder\",RANDBETWEEN(Easy+Medium+1,Easy+Medium+Hard),RANDBETWEEN(1,Easy+Medium+Hard)))),B2)","v":101},{"$f":"IF(COUNTIF(C$1:C2,C2)<>1,IF($A2=\"Easiest\",RANDBETWEEN(1,Easy),IF($A2=\"Medium\",RANDBETWEEN(Easy+1,Easy+Medium),IF($A2=\"Harder\",RANDBETWEEN(Easy+Medium+1,Easy+Medium+Hard),RANDBETWEEN(1,Easy+Medium+Hard)))),C2)","v":101},{"$f":"IF(COUNTIF(D$1:D2,D2)<>1,IF($A2=\"Easiest\",RANDBETWEEN(1,Easy),IF($A2=\"Medium\",RANDBETWEEN(Easy+1,Easy+Medium),IF($A2=\"Harder\",RANDBETWEEN(Easy+Medium+1,Easy+Medium+Hard),RANDBETWEEN(1,Easy+Medium+Hard)))),D2)","v":101},{"$f":"IF(COUNTIF(E$1:E2,E2)<>1,IF($A2=\"Easiest\",RANDBETWEEN(1,Easy),IF($A2=\"Medium\",RANDBETWEEN(Easy+1,Easy+Medium),IF($A2=\"Harder\",RANDBETWEEN(Easy+Medium+1,Easy+Medium+Hard),RANDBETWEEN(1,Easy+Medium+Hard)))),E2)","v":101},2,{"$f":"VLOOKUP($F2,'System DO NOT OPEN'!$A$8:$Q$400,12)","v":"What temperature is 30°C higher than –19°C ?"},{"$f":"VLOOKUP($F2,'System DO NOT OPEN'!$A$8:$Q$400,17)","v":"11°C"}]
[{"$f":"Worksheet!D5","v":"Easiest"},59,{"$f":"IF(COUNTIF(B$1:B3,B3)<>1,IF($A3=\"Easiest\",RANDBETWEEN(1,Easy),IF($A3=\"Medium\",RANDBETWEEN(Easy+1,Easy+Medium),IF($A3=\"Harder\",RANDBETWEEN(Easy+Medium+1,Easy+Medium+Hard),RANDBETWEEN(1,Easy+Medium+Hard)))),B3)","v":59},{"$f":"IF(COUNTIF(C$1:C3,C3)<>1,IF($A3=\"Easiest\",RANDBETWEEN(1,Easy),IF($A3=\"Medium\",RANDBETWEEN(Easy+1,Easy+Medium),IF($A3=\"Harder\",RANDBETWEEN(Easy+Medium+1,Easy+Medium+Hard),RANDBETWEEN(1,Easy+Medium+Hard)))),C3)","v":59},{"$f":"IF(COUNTIF(D$1:D3,D3)<>1,IF($A3=\"Easiest\",RANDBETWEEN(1,Easy),IF($A3=\"Medium\",RANDBETWEEN(Easy+1,Easy+Medium),IF($A3=\"Harder\",RANDBETWEEN(Easy+Medium+1,Easy+Medium+Hard),RANDBETWEEN(1,Easy+Medium+Hard)))),D3)","v":59},{"$f":"IF(COUNTIF(E$1:E3,E3)<>1,IF($A3=\"Easiest\",RANDBETWEEN(1,Easy),IF($A3=\"Medium\",RANDBETWEEN(Easy+1,Easy+Medium),IF($A3=\"Harder\",RANDBETWEEN(Easy+Medium+1,Easy+Medium+Hard),RANDBETWEEN(1,Easy+Medium+Hard)))),E3)","v":59},3,{"$f":"VLOOKUP($F3,'System DO NOT OPEN'!$A$8:$Q$400,12)","v":"Add the fractions: 2/3 + 1/4.   Express your answer as a fraction in its simplest form."},{"$f":"VLOOKUP($F3,'System DO NOT OPEN'!$A$8:$Q$400,17)","v":"11/12"}]
[{"$f":"Worksheet!D6","v":"Easiest"},109,{"$f":"IF(COUNTIF(B$1:B4,B4)<>1,IF($A4=\"Easiest\",RANDBETWEEN(1,Easy),IF($A4=\"Medium\",RANDBETWEEN(Easy+1,Easy+Medium),IF($A4=\"Harder\",RANDBETWEEN(Easy+Medium+1,Easy+Medium+Hard),RANDBETWEEN(1,Easy+Medium+Hard)))),B4)","v":109},{"$f":"IF(COUNTIF(C$1:C4,C4)<>1,IF($A4=\"Easiest\",RANDBETWEEN(1,Easy),IF($A4=\"Medium\",RANDBETWEEN(Easy+1,Easy+Medium),IF($A4=\"Harder\",RANDBETWEEN(Easy+Medium+1,Easy+Medium+Hard),RANDBETWEEN(1,Easy+Medium+Hard)))),C4)","v":109},{"$f":"IF(COUNTIF(D$1:D4,D4)<>1,IF($A4=\"Easiest\",RANDBETWEEN(1,Easy),IF($A4=\"Medium\",RANDBETWEEN(Easy+1,Easy+Medium),IF($A4=\"Harder\",RANDBETWEEN(Easy+Medium+1,Easy+Medium+Hard),RANDBETWEEN(1,Easy+Medium+Hard)))),D4)","v":109},{"$f":"IF(COUNTIF(E$1:E4,E4)<>1,IF($A4=\"Easiest\",RANDBETWEEN(1,Easy),IF($A4=\"Medium\",RANDBETWEEN(Easy+1,Easy+Medium),IF($A4=\"Harder\",RANDBETWEEN(Easy+Medium+1,Easy+Medium+Hard),RANDBETWEEN(1,Easy+Medium+Hard)))),E4)","v":109},4,{"$f":"VLOOKUP($F4,'System DO NOT OPEN'!$A$8:$Q$400,12)","v":"Express    (a)  72 centimetres and    (b)  79 centimetres in millimetres"},{"$f":"VLOOKUP($F4,'System DO NOT OPEN'!$A$8:$Q$400,17)","v":"720 mm and 790 mm"}]
[{"$f":"Worksheet!D7","v":"Medium"},238,{"$f":"IF(COUNTIF(B$1:B5,B5)<>1,IF($A5=\"Easiest\",RANDBETWEEN(1,Easy),IF($A5=\"Medium\",RANDBETWEEN(Easy+1,Easy+Medium),IF($A5=\"Harder\",RANDBETWEEN(Easy+Medium+1,Easy+Medium+Hard),RANDBETWEEN(1,Easy+Medium+Hard)))),B5)","v":238},{"$f":"IF(COUNTIF(C$1:C5,C5)<>1,IF($A5=\"Easiest\",RANDBETWEEN(1,Easy),IF($A5=\"Medium\",RANDBETWEEN(Easy+1,Easy+Medium),IF($A5=\"Harder\",RANDBETWEEN(Easy+Medium+1,Easy+Medium+Hard),RANDBETWEEN(1,Easy+Medium+Hard)))),C5)","v":238},{"$f":"IF(COUNTIF(D$1:D5,D5)<>1,IF($A5=\"Easiest\",RANDBETWEEN(1,Easy),IF($A5=\"Medium\",RANDBETWEEN(Easy+1,Easy+Medium),IF($A5=\"Harder\",RANDBETWEEN(Easy+Medium+1,Easy+Medium+Hard),RANDBETWEEN(1,Easy+Medium+Hard)))),D5)","v":238},{"$f":"IF(COUNTIF(E$1:E5,E5)<>1,IF($A5=\"Easiest\",RANDBETWEEN(1,Easy),IF($A5=\"Medium\",RANDBETWEEN(Easy+1,Easy+Medium),IF($A5=\"Harder\",RANDBETWEEN(Easy+Medium+1,Easy+Medium+Hard),RANDBETWEEN(1,Easy+Medium+Hard)))),E5)","v":238},5,{"$f":"VLOOKUP($F5,'System DO NOT OPEN'!$A$8:$Q$400,12)","v":"Express 6.7 hours in hours and minutes"},{"$f":"VLOOKUP($F5,'System DO NOT OPEN'!$A$8:$Q$400,17)","v":"6 hours 42 minutes"}]
[{"$f":"Worksheet!D8","v":"Medium"},206,{"$f":"IF(COUNTIF(B$1:B6,B6)<>1,IF($A6=\"Easiest\",RANDBETWEEN(1,Easy),IF($A6=\"Medium\",RANDBETWEEN(Easy+1,Easy+Medium),IF($A6=\"Harder\",RANDBETWEEN(Easy+Medium+1,Easy+Medium+Hard),RANDBETWEEN(1,Easy+Medium+Hard)))),B6)","v":206},{"$f":"IF(COUNTIF(C$1:C6,C6)<>1,IF($A6=\"Easiest\",RANDBETWEEN(1,Easy),IF($A6=\"Medium\",RANDBETWEEN(Easy+1,Easy+Medium),IF($A6=\"Harder\",RANDBETWEEN(Easy+Medium+1,Easy+Medium+Hard),RANDBETWEEN(1,Easy+Medium+Hard)))),C6)","v":206},{"$f":"IF(COUNTIF(D$1:D6,D6)<>1,IF($A6=\"Easiest\",RANDBETWEEN(1,Easy),IF($A6=\"Medium\",RANDBETWEEN(Easy+1,Easy+Medium),IF($A6=\"Harder\",RANDBETWEEN(Easy+Medium+1,Easy+Medium+Hard),RANDBETWEEN(1,Easy+Medium+Hard)))),D6)","v":206},{"$f":"IF(COUNTIF(E$1:E6,E6)<>1,IF($A6=\"Easiest\",RANDBETWEEN(1,Easy),IF($A6=\"Medium\",RANDBETWEEN(Easy+1,Easy+Medium),IF($A6=\"Harder\",RANDBETWEEN(Easy+Medium+1,Easy+Medium+Hard),RANDBETWEEN(1,Easy+Medium+Hard)))),E6)","v":206},6,{"$f":"VLOOKUP($F6,'System DO NOT OPEN'!$A$8:$Q$400,12)","v":"Calculate:   £9.10 × 40 – £8.08 – £5.43"},{"$f":"VLOOKUP($F6,'System DO NOT OPEN'!$A$8:$Q$400,17)","v":"£350.49"}]
[{"$f":"Worksheet!D9","v":"Medium"},224,{"$f":"IF(COUNTIF(B$1:B7,B7)<>1,IF($A7=\"Easiest\",RANDBETWEEN(1,Easy),IF($A7=\"Medium\",RANDBETWEEN(Easy+1,Easy+Medium),IF($A7=\"Harder\",RANDBETWEEN(Easy+Medium+1,Easy+Medium+Hard),RANDBETWEEN(1,Easy+Medium+Hard)))),B7)","v":224},{"$f":"IF(COUNTIF(C$1:C7,C7)<>1,IF($A7=\"Easiest\",RANDBETWEEN(1,Easy),IF($A7=\"Medium\",RANDBETWEEN(Easy+1,Easy+Medium),IF($A7=\"Harder\",RANDBETWEEN(Easy+Medium+1,Easy+Medium+Hard),RANDBETWEEN(1,Easy+Medium+Hard)))),C7)","v":224},{"$f":"IF(COUNTIF(D$1:D7,D7)<>1,IF($A7=\"Easiest\",RANDBETWEEN(1,Easy),IF($A7=\"Medium\",RANDBETWEEN(Easy+1,Easy+Medium),IF($A7=\"Harder\",RANDBETWEEN(Easy+Medium+1,Easy+Medium+Hard),RANDBETWEEN(1,Easy+Medium+Hard)))),D7)","v":224},{"$f":"IF(COUNTIF(E$1:E7,E7)<>1,IF($A7=\"Easiest\",RANDBETWEEN(1,Easy),IF($A7=\"Medium\",RANDBETWEEN(Easy+1,Easy+Medium),IF($A7=\"Harder\",RANDBETWEEN(Easy+Medium+1,Easy+Medium+Hard),RANDBETWEEN(1,Easy+Medium+Hard)))),E7)","v":224},7,{"$f":"VLOOKUP($F7,'System DO NOT OPEN'!$A$8:$Q$400,12)","v":"Express the ratio in its simplest form:           84 : 144 : 84"},{"$f":"VLOOKUP($F7,'System DO NOT OPEN'!$A$8:$Q$400,17)","v":"7 : 12 : 7"}]
[{"$f":"Worksheet!D10","v":"Medium"},241,{"$f":"IF(COUNTIF(B$1:B8,B8)<>1,IF($A8=\"Easiest\",RANDBETWEEN(1,Easy),IF($A8=\"Medium\",RANDBETWEEN(Easy+1,Easy+Medium),IF($A8=\"Harder\",RANDBETWEEN(Easy+Medium+1,Easy+Medium+Hard),RANDBETWEEN(1,Easy+Medium+Hard)))),B8)","v":241},{"$f":"IF(COUNTIF(C$1:C8,C8)<>1,IF($A8=\"Easiest\",RANDBETWEEN(1,Easy),IF($A8=\"Medium\",RANDBETWEEN(Easy+1,Easy+Medium),IF($A8=\"Harder\",RANDBETWEEN(Easy+Medium+1,Easy+Medium+Hard),RANDBETWEEN(1,Easy+Medium+Hard)))),C8)","v":241},{"$f":"IF(COUNTIF(D$1:D8,D8)<>1,IF($A8=\"Easiest\",RANDBETWEEN(1,Easy),IF($A8=\"Medium\",RANDBETWEEN(Easy+1,Easy+Medium),IF($A8=\"Harder\",RANDBETWEEN(Easy+Medium+1,Easy+Medium+Hard),RANDBETWEEN(1,Easy+Medium+Hard)))),D8)","v":241},{"$f":"IF(COUNTIF(E$1:E8,E8)<>1,IF($A8=\"Easiest\",RANDBETWEEN(1,Easy),IF($A8=\"Medium\",RANDBETWEEN(Easy+1,Easy+Medium),IF($A8=\"Harder\",RANDBETWEEN(Easy+Medium+1,Easy+Medium+Hard),RANDBETWEEN(1,Easy+Medium+Hard)))),E8)","v":241},8,{"$f":"VLOOKUP($F8,'System DO NOT OPEN'!$A$8:$Q$400,12)","v":"Express 2 minutes 36  seconds in minutes (using a decimal point)"},{"$f":"VLOOKUP($F8,'System DO NOT OPEN'!$A$8:$Q$400,17)","v":"2.6 minutes "}]
[{"$f":"Worksheet!D11","v":"Medium"},240,{"$f":"IF(COUNTIF(B$1:B9,B9)<>1,IF($A9=\"Easiest\",RANDBETWEEN(1,Easy),IF($A9=\"Medium\",RANDBETWEEN(Easy+1,Easy+Medium),IF($A9=\"Harder\",RANDBETWEEN(Easy+Medium+1,Easy+Medium+Hard),RANDBETWEEN(1,Easy+Medium+Hard)))),B9)","v":240},{"$f":"IF(COUNTIF(C$1:C9,C9)<>1,IF($A9=\"Easiest\",RANDBETWEEN(1,Easy),IF($A9=\"Medium\",RANDBETWEEN(Easy+1,Easy+Medium),IF($A9=\"Harder\",RANDBETWEEN(Easy+Medium+1,Easy+Medium+Hard),RANDBETWEEN(1,Easy+Medium+Hard)))),C9)","v":240},{"$f":"IF(COUNTIF(D$1:D9,D9)<>1,IF($A9=\"Easiest\",RANDBETWEEN(1,Easy),IF($A9=\"Medium\",RANDBETWEEN(Easy+1,Easy+Medium),IF($A9=\"Harder\",RANDBETWEEN(Easy+Medium+1,Easy+Medium+Hard),RANDBETWEEN(1,Easy+Medium+Hard)))),D9)","v":240},{"$f":"IF(COUNTIF(E$1:E9,E9)<>1,IF($A9=\"Easiest\",RANDBETWEEN(1,Easy),IF($A9=\"Medium\",RANDBETWEEN(Easy+1,Easy+Medium),IF($A9=\"Harder\",RANDBETWEEN(Easy+Medium+1,Easy+Medium+Hard),RANDBETWEEN(1,Easy+Medium+Hard)))),E9)","v":240},9,{"$f":"VLOOKUP($F9,'System DO NOT OPEN'!$A$8:$Q$400,12)","v":"Express 6.6 minutes in minutes and seconds"},{"$f":"VLOOKUP($F9,'System DO NOT OPEN'!$A$8:$Q$400,17)","v":"6 minutes 36 seconds"}]
[{"$f":"Worksheet!D12","v":"Medium"},156,{"$f":"IF(COUNTIF(B$1:B10,B10)<>1,IF($A10=\"Easiest\",RANDBETWEEN(1,Easy),IF($A10=\"Medium\",RANDBETWEEN(Easy+1,Easy+Medium),IF($A10=\"Harder\",RANDBETWEEN(Easy+Medium+1,Easy+Medium+Hard),RANDBETWEEN(1,Easy+Medium+Hard)))),B10)","v":156},{"$f":"IF(COUNTIF(C$1:C10,C10)<>1,IF($A10=\"Easiest\",RANDBETWEEN(1,Easy),IF($A10=\"Medium\",RANDBETWEEN(Easy+1,Easy+Medium),IF($A10=\"Harder\",RANDBETWEEN(Easy+Medium+1,Easy+Medium+Hard),RANDBETWEEN(1,Easy+Medium+Hard)))),C10)","v":156},{"$f":"IF(COUNTIF(D$1:D10,D10)<>1,IF($A10=\"Easiest\",RANDBETWEEN(1,Easy),IF($A10=\"Medium\",RANDBETWEEN(Easy+1,Easy+Medium),IF($A10=\"Harder\",RANDBETWEEN(Easy+Medium+1,Easy+Medium+Hard),RANDBETWEEN(1,Easy+Medium+Hard)))),D10)","v":156},{"$f":"IF(COUNTIF(E$1:E10,E10)<>1,IF($A10=\"Easiest\",RANDBETWEEN(1,Easy),IF($A10=\"Medium\",RANDBETWEEN(Easy+1,Easy+Medium),IF($A10=\"Harder\",RANDBETWEEN(Easy+Medium+1,Easy+Medium+Hard),RANDBETWEEN(1,Easy+Medium+Hard)))),E10)","v":156},10,{"$f":"VLOOKUP($F10,'System DO NOT OPEN'!$A$8:$Q$400,12)","v":"Express the fraction in its simplest form:           8/16"},{"$f":"VLOOKUP($F10,'System DO NOT OPEN'!$A$8:$Q$400,17)","v":"1/2"}]
{"$rows_left_out":11}
{"sheet":"System DO NOT OPEN","index":2,"n_rows":322,"n_cols":19,"rows_kept":322,"cut":false,"hidden":false,"merged":[]}
["Must be sorted by column B"]
["Number of easy questions",{"$f":"COUNTIF(ABC,\"A\")","v":114}]
["Number of medium questions",{"$f":"COUNTIF(ABC,\"B\")","v":132}]
["Number of hard questions",{"$f":"COUNTIF(ABC,\"C\")","v":69}]
["TOTAL",{"$f":"COUNT(Numbers)","v":218}]
[null,{"$f":"B2+B3+B4=B5","v":false}]
["Question number","Difficulty",null,null,null,null,null,null,null,null,null,null,null,null,null,null,"Answer"]
[{"$f":"IF(ISBLANK(C8),\" \",ROW(B8)-7)","v":1},"A","A shop offers a discount of ",1,"/",{"$f":"RANDBETWEEN(3,5)","v":5}," on a price of ",{"$f":"CHOOSE(K8,\"£\",\"£\",\"$\",\"€\",\"\",\"\",\"\",\"\",\"\",\"\",\"\")","v":"£"},{"$f":"TEXT(F8*RANDBETWEEN(51,99)/10,\"#.00\")","v":"41.50"},".   What is the new price?",{"$f":"RANDBETWEEN(1,4)","v":2},{"$f":"CONCATENATE(\"\",C8,\"\",D8,\"\",E8,\"\",F8,\"\",G8,\"\",H8,\"\",I8,\"\",J8,\"\")","v":"A shop offers a discount of 1/5 on a price of £41.50.   What is the new price?"},{"$f":"H8","v":"£"},{"$f":"TEXT(I8/F8*(F8-1),\"#.00\")","v":"33.20"},null,null,{"$f":"CONCATENATE(\"\",M8,\"\",N8,\"\",O8,\"\",P8,\"\")","v":"£33.20"}]
[{"$f":"IF(ISBLANK(C9),\" \",ROW(B9)-7)","v":2},"A","Add the fractions: ",{"$f":"IF(F9=3,RANDBETWEEN(1,2),IF(F9=4,IF(RAND()<0.4,1,3),IF(F9=5,RANDBETWEEN(2,4),IF(RAND()<0.33,3,IF(RAND()<0.5,7,9)))))","v":2},"/",{"$f":"CHOOSE(K9,3,3,3,4,4,4,5,5,5,10,10,10)","v":3}," + ",{"$f":"IF(J9=3,RANDBETWEEN(1,2),IF(J9=4,IF(RAND()<0.4,1,3),IF(J9=5,RANDBETWEEN(2,4),IF(RAND()<0.33,3,IF(RAND()<0.5,7,9)))))","v":3},"/",{"$f":"CHOOSE(K9,4,5,10,3,5,10,3,4,10,4,5,10)","v":5},{"$f":"RANDBETWEEN(1,12)","v":2},{"$f":"CONCATENATE(\"\",C9,\"\",D9,\"\",E9,\"\",F9,\"\",G9,\"\",H9,\"\",I9,\"\",J9,\".   Express your answer as a fraction in its simplest form.\")","v":"Add the fractions: 2/3 + 3/5.   Express your answer as a fraction in its simplest form."},{"$f":"R9/GCD(R9,S9)","v":19},"/",{"$f":"S9/GCD(R9,S9)","v":15},null,{"$f":"CONCATENATE(\"\",M9,\"\",N9,\"\",O9,\"\",IF(M9/O9>1,CONCATENATE(\"   or   \",INT(M9/O9),\"  \",MOD(M9,O9),\"/\",O9),\"\"))","v":"19/15   or   1  4/15"},{"$f":"D9*J9+F9*H9","v":19},{"$f":"F9*J9","v":15}]
[{"$f":"IF(ISBLANK(D10),\" \",ROW(B10)-7)","v":3},"A","Calculate ",{"$f":"CHOOSE(RANDBETWEEN(1,2),\"25%\",\"75%\")","v":"75%"}," of ",{"$f":"CHOOSE(K10,\"£\",\"£\",\"$\",\"€\",\"\",\"\",\"\",\"\",\"\",\"\",\"\")","v":""},{"$f":"4*RANDBETWEEN(11,99)*10^RANDBETWEEN(1,3)","v":140000},{"$f":"CHOOSE(K10,\"\",\"\",\"\",\"\",\"km\",\"m\",\"kg\",\" litres\",\" miles\",\"\",\"\")","v":" miles"},null,null,{"$f":"RANDBETWEEN(1,11)","v":9},{"$f":"CONCATENATE(\"\",C10,\"\",D10,\"\",E10,\"\",F10,\"\",G10,\"\",H10,\"\",I10,\"\",J10,\"\")","v":"Calculate 75% of 140000 miles"},{"$f":"F10","v":""},{"$f":"IF(D10=\"25%\",G10/4,G10/4*3)","v":105000},{"$f":"H10","v":" miles"},null,{"$f":"CONCATENATE(\"\",M10,\"\",N10,\"\",O10,\"\",P10,\"\")","v":"105000 miles"}]
{"$rows_left_out":312}