{"text_format":"1","workbook":"xlsx","n_sheets":3,"sheets":["Worksheet","SYSTEM FORMULAE 2","SYSTEM FORMULAE"],"not_rendered":{"charts":0,"images":0,"macros":1,"external_links":0,"defined_names":2,"comments":0,"pivot_tables":0},"unopened":[],"bounds":{"document_bytes":16777216,"sheet_cells":100000,"rows_first":2000,"rows_last":500,"rows_between":2000,"halvings":0,"cell_chars":16384,"cell_head_chars":4096},"cells_cut":0,"cells_raw":0,"read":"whole","date_system":"1900"}

{"sheet":"Worksheet","index":0,"n_rows":37,"n_cols":10,"rows_kept":37,"cut":false,"hidden":false,"merged":[[0,3,0,8],[5,0,5,1],[1,3,1,8],[13,3,13,8],[25,3,25,8]]}
[null,null,null,"Complete these monthly payslips and calculate the net pay"]
[null,null,null,"This is Mohammed Thomson's monthly wage slip.                                                                                                                                                                                                                                                                     •  Mohammed is paid a basic hourly wage of £18.92, has monthly tax allowances of £844, and pays tax at the standard rate of 20%.                                                                                                                                                                                                            •  Mohammed pays 11.9% of his gross monthly pay over £611 towards his National Insurance.                                                                                                                                                                                      •  6.1% of his gross monthly pay also goes into his pension fund.                                                                                                                                                                                      Calculate Mohammed's net monthly pay."]
[null,null,null,"Name","Employee number","Month","Date","Tax Code","NI Number"]
[null,null,null,"Mohammed Thomson",170927,3,"2024-05-30","S844L","MH 89 41 64 A"]
[]
["Variables",null,null,"MONTHLY PAY",null,null,null,"               MONTHLY DEDUCTIONS",null,""]
["SHOW ANSWERS",false,null,null,"Hourly wage","Hours worked","TOTAL",null,"TOTAL",8]
["Calculate tax?",true,null,"Basic hours",18.920000000000002,108,2043.3600000000001,"Tax",395.9620000000001,9]
["Calculate National Insurance?",true,null,"Overtime (time-and-a-quarter)",23.650000000000002,33,780.45,"National Insurance",254.8,10]
["Calculate pension?",true,null,"","","","","Pension",172.25241000000003]
["Calculate commission?",false,null,null,null,"GROSS MONTHLY PAY",2823.8100000000004,"TOTAL DEDUCTIONS",823.01441000000023]
[]
["Calculate overtime?",true,null,null,null,null,null,"NET PAY ",2000.7955900000002]
[null,null,null,"This is Bradley Wood's monthly wage slip.                                                                                                                                                                                                                                                                     •  Bradley is paid a basic hourly wage of £10.80, has monthly tax allowances of £1012, and pays tax at the standard rate of 20%.                                                                                                                                                                                                            •  Bradley pays 10.8% of his gross monthly pay over £683 towards his National Insurance.                                                                                                                                                                                      •  5.8% of his gross monthly pay also goes into his pension fund.                                                                                                                                                                                      Calculate Bradley's net monthly pay."]
[null,null,null,"Name","Employee number","Month","Date","Tax Code","NI Number"]
[null,null,null,"Bradley Wood",8787,5,"2024-07-05","S1012L","SO 86 81 91 D"]
[]
[null,null,null,"MONTHLY PAY",null,null,null,"               MONTHLY DEDUCTIONS",null,21]
[null,null,null,null,"Hourly wage","Hours worked","TOTAL",null,"TOTAL",22]
[null,null,null,"Basic hours",10.8,89,961.2,"Tax",132.4,20]
{"$rows_left_out":18}
{"sheet":"SYSTEM FORMULAE 2","index":1,"n_rows":37,"n_cols":10,"rows_kept":37,"cut":false,"hidden":false,"merged":[]}
[]
[null,null,null,{"$f":"CONCATENATE(\"This is \",A4,\" \",A5,\"'s monthly wage slip.                                                                                                                                                                                                                                          \",\"                           •  \",A4,\" is paid a basic hourly wage of £\",TEXT(E8,\"#.00\"),IF(Worksheet!$B$8,CONCATENATE(\", has monthly tax allowances of £\",VALUE(LEFT(RIGHT(H4,LEN(H4)-1),LEN(RIGHT(H4,LEN(H4)-1))-1)),\", and pays tax at the standard rate of 20%.                                                                                                                                                                                                            \"),\".                                                                                                                                                                                                       \"),CONCATENATE(IF(Worksheet!$B$11,CONCATENATE(\"•  \",A4,\" is also paid \",A6,\"% commission on \",IF(B4=\"M\",\"his\",IF(B4=\"F\",\"her\",\"their\")),\" sales.                                                                                                                                                                                                                      \"),\"\")),CONCATENATE(IF(Worksheet!$B$9,CONCATENATE(\"•  \",A4,\" pays \",B11,\"% of \",IF(B4=\"M\",\"his\",IF(B4=\"F\",\"her\",\"their\")),\" gross monthly pay over £\",B10,\" towards \",IF(B4=\"M\",\"his\",IF(B4=\"F\",\"her\",\"their\")),\" National Insurance.                                                                                                                                                                                      \"),\"\")),CONCATENATE(IF(Worksheet!$B$10,CONCATENATE(\"•  \",A11,\"% of \",IF(B4=\"M\",\"his\",IF(B4=\"F\",\"her\",\"their\")),\" gross monthly pay also goes into \",IF(B4=\"M\",\"his\",IF(B4=\"F\",\"her\",\"their\")),\" pension fund.                                                                                                                                                                                      \"),\"\")),CONCATENATE(\"Calculate \",IF(Worksheet!$B$11,\"the\",CONCATENATE(A4,\"'s\")),\" net monthly pay\",IF(Worksheet!$B$11,CONCATENATE(\" in a month where \",A4,\"'s sales are £\",A7,\".\"),\".\")))","v":"This is Henry Stewart's monthly wage slip.                                                                                                                                                                                                                                                                     •  Henry is paid a basic hourly wage of £10.86, has monthly tax allowances of £1391, and pays tax at the standard rate of 20%.                                                                                                                                                                                                            •  Henry pays 6.1% of his gross monthly pay over £528 towards his National Insurance.                                                                                                                                                                                      •  5% of his gross monthly pay also goes into his pension fund.                                                                                                                                                                                      Calculate Henry's net monthly pay."}]
[{"$f":"RANDBETWEEN(1,200)","v":56},null,null,"Name","Employee number","Month","Date","Tax Code","NI Number"]
[{"$f":"INDEX('SYSTEM FORMULAE'!A$2:A$201,A3)","v":"Henry"},{"$f":"INDEX('SYSTEM FORMULAE'!B$2:B$201,A3)","v":"M"},null,{"$f":"CONCATENATE(A4,\" \",A5)","v":"Henry Stewart"},{"$f":"IF(RAND()<0.3,RANDBETWEEN(1,99),IF(RAND()<0.35,RANDBETWEEN(100,9999),RANDBETWEEN(10000,999999)))","v":267479},{"$f":"MOD(MONTH(G4)+9,12)+1","v":2},{"$f":"TODAY()+RANDBETWEEN(-50,50)","v":"2024-04-29"},{"$f":"CONCATENATE(\"S\",RANDBETWEEN(800,1400),\"L\")","v":"S1391L"},{"$f":"CONCATENATE(CHOOSE(RANDBETWEEN(1,20),\"A\",\"B\",\"C\",\"E\",\"G\",\"H\",\"J\",\"K\",\"L\",\"M\",\"N\",\"O\",\"P\",\"R\",\"S\",\"T\",\"W\",\"X\",\"Y\",\"Z\"),CHOOSE(RANDBETWEEN(1,20),\"A\",\"B\",\"C\",\"E\",\"G\",\"H\",\"J\",\"K\",\"L\",\"M\",\"N\",\"O\",\"P\",\"R\",\"S\",\"T\",\"W\",\"X\",\"Y\",\"Z\"),\" \",RANDBETWEEN(1,9),RANDBETWEEN(1,9),\" \",RANDBETWEEN(1,9),RANDBETWEEN(1,9),\" \",RANDBETWEEN(1,9),RANDBETWEEN(1,9),\" \",CHOOSE(RANDBETWEEN(1,4),\"A\",\"B\",\"C\",\"D\"))","v":"JA 93 22 25 B"}]
[{"$f":"INDEX('SYSTEM FORMULAE'!C$2:C$51,RANDBETWEEN(1,50))","v":"Stewart"}]
[{"$f":"RANDBETWEEN(7,15)/2","v":6.5},null,null,"MONTHLY PAY",null,null,null,"               MONTHLY DEDUCTIONS",null,{"$f":"IF(D10=\"\",\"\",3*ROW(G8)+3-J7-J8)","v":""}]
[{"$f":"(RANDBETWEEN(12,100)*10000+RANDBETWEEN(1,9)*1000)/10","v":65400},null,null,null,"Hourly wage","Hours worked","TOTAL",null,"TOTAL",{"$f":"IF(D10=\"\",RANDBETWEEN(ROW(G8),ROW(G8)+1),RANDBETWEEN(ROW(G8),ROW(G8)+2))","v":8}]
[null,null,null,"Basic hours",{"$f":"RANDBETWEEN(430,1200)/50","v":10.86},{"$f":"RANDBETWEEN(40,140)","v":112},{"$f":"E8*F8","v":1216.32},"Tax",{"$f":"(G11-VALUE(LEFT(RIGHT(H4,LEN(H4)-1),LEN(RIGHT(H4,LEN(H4)-1))-1)))*0.2","v":118.18999999999997},{"$f":"IF(D10=\"\",IF(J7=ROW(G8),ROW(G8)+1,ROW(G8)),IF(J7=ROW(G8),RANDBETWEEN(ROW(G8)+1,ROW(G8)+2),IF(J7=ROW(G8)+2,RANDBETWEEN(ROW(G8),ROW(G8)+1),CHOOSE(RANDBETWEEN(1,2),ROW(G8),ROW(G8)+2))))","v":9}]
[{"$f":"RANDBETWEEN(1,IF(RAND()<0.3,3,2))","v":2},null,null,{"$f":"CHOOSE(A9,\"Overtime (double time)\",\"Overtime (time-and-a-half)\",\"Overtime (time-and-a-quarter)\")","v":"Overtime (time-and-a-half)"},{"$f":"CHOOSE(A9,2,1.5,1.25)*E8","v":16.29},{"$f":"RANDBETWEEN(4,50)","v":47},{"$f":"E9*F9","v":765.63},"National Insurance",{"$f":"INT(0.09*G11)+0.1*RANDBETWEEN(0,9)","v":178.7},{"$f":"RANDBETWEEN(ROW(G8),ROW(G8)+2)","v":9}]
[{"$f":"IF(A9=1,RANDBETWEEN(2,3),IF(A9=3,RANDBETWEEN(1,2),CHOOSE(RANDBETWEEN(1,2),1,3)))","v":3},{"$f":"RANDBETWEEN(500,VALUE(LEFT(RIGHT(H4,LEN(H4)-1),LEN(RIGHT(H4,LEN(H4)-1))-1)))","v":528},null,{"$f":"IF(Worksheet!$B$11,\"Commission\",IF(AND(RAND()<0.5,Worksheet!$B$13),CHOOSE(A10,\"Overtime (double time)\",\"Overtime (time-and-a-half)\",\"Overtime (time-and-a-quarter)\"),\"\"))","v":""},{"$f":"IF(LEFT(D10,4)=\"Comm\",\"-\",IF(D10=\"\",\"\",CHOOSE(A10,2,1.5,1.25)*E8))","v":""},{"$f":"IF(LEFT(D10,4)=\"Comm\",\"-\",IF(D10=\"\",\"\",RANDBETWEEN(4,50)))","v":""},{"$f":"IF(D10=\"\",\"\",IF(LEFT(D10,4)=\"Comm\",A6/100*A7,E10*F10))","v":""},"Pension",{"$f":"G11*A11/100","v":99.097499999999997}]
[{"$f":"RANDBETWEEN(30,70)/10","v":5},{"$f":"RANDBETWEEN(60,120)/10","v":6.1},null,null,null,"GROSS MONTHLY PAY",{"$f":"SUM(G8:G10)","v":1981.9499999999998},"TOTAL DEDUCTIONS",{"$f":"SUM(I8:I10)","v":395.98749999999995}]
[]
[null,null,null,null,null,null,null,"NET PAY ",{"$f":"G11-I11","v":1585.9624999999999}]
[null,null,null,{"$f":"CONCATENATE(\"This is \",A16,\" \",A17,\"'s monthly wage slip.                                                                                                                                                                                                                                          \",\"                           •  \",A16,\" is paid a basic hourly wage of £\",TEXT(E20,\"#.00\"),IF(Worksheet!$B$8,CONCATENATE(\", has monthly tax allowances of £\",VALUE(LEFT(RIGHT(H16,LEN(H16)-1),LEN(RIGHT(H16,LEN(H16)-1))-1)),\", and pays tax at the standard rate of 20%.                                                                                                                                                                                                            \"),\".                                                                                                                                                                                                       \"),CONCATENATE(IF(Worksheet!$B$11,CONCATENATE(\"•  \",A16,\" is also paid \",A18,\"% commission on \",IF(B16=\"M\",\"his\",IF(B16=\"F\",\"her\",\"their\")),\" sales.                                                                                                                                                                                                                      \"),\"\")),CONCATENATE(IF(Worksheet!$B$9,CONCATENATE(\"•  \",A16,\" pays \",B23,\"% of \",IF(B16=\"M\",\"his\",IF(B16=\"F\",\"her\",\"their\")),\" gross monthly pay over £\",B22,\" towards \",IF(B16=\"M\",\"his\",IF(B16=\"F\",\"her\",\"their\")),\" National Insurance.                                                                                                                                                                                      \"),\"\")),CONCATENATE(IF(Worksheet!$B$10,CONCATENATE(\"•  \",A23,\"% of \",IF(B16=\"M\",\"his\",IF(B16=\"F\",\"her\",\"their\")),\" gross monthly pay also goes into \",IF(B16=\"M\",\"his\",IF(B16=\"F\",\"her\",\"their\")),\" pension fund.                                                                                                                                                                                      \"),\"\")),CONCATENATE(\"Calculate \",IF(Worksheet!$B$11,\"the\",CONCATENATE(A16,\"'s\")),\" net monthly pay\",IF(Worksheet!$B$11,CONCATENATE(\" in a month where \",A16,\"'s sales are £\",A19,\".\"),\".\")))","v":"This is Mia Clark's monthly wage slip.                                                                                                                                                                                                                                                                     •  Mia is paid a basic hourly wage of £16.54, has monthly tax allowances of £1077, and pays tax at the standard rate of 20%.                                                                                                                                                                                                            •  Mia pays 11.7% of her gross monthly pay over £1012 towards her National Insurance.                                                                                                                                                                                      •  6.5% of her gross monthly pay also goes into her pension fund.                                                                                                                                                                                      Calculate Mia's net monthly pay."}]
[{"$f":"RANDBETWEEN(1,200)","v":125},null,null,"Name","Employee number","Month","Date","Tax Code","NI Number"]
[{"$f":"INDEX('SYSTEM FORMULAE'!A$2:A$201,A15)","v":"Mia"},{"$f":"INDEX('SYSTEM FORMULAE'!B$2:B$201,A15)","v":"F"},null,{"$f":"CONCATENATE(A16,\" \",A17)","v":"Mia Clark"},{"$f":"IF(RAND()<0.3,RANDBETWEEN(1,99),IF(RAND()<0.35,RANDBETWEEN(100,9999),RANDBETWEEN(10000,999999)))","v":9229},{"$f":"MOD(MONTH(G16)+9,12)+1","v":4},{"$f":"TODAY()+RANDBETWEEN(-50,50)","v":"2024-06-22"},{"$f":"CONCATENATE(\"S\",RANDBETWEEN(800,1400),\"L\")","v":"S1077L"},{"$f":"CONCATENATE(CHOOSE(RANDBETWEEN(1,20),\"A\",\"B\",\"C\",\"E\",\"G\",\"H\",\"J\",\"K\",\"L\",\"M\",\"N\",\"O\",\"P\",\"R\",\"S\",\"T\",\"W\",\"X\",\"Y\",\"Z\"),CHOOSE(RANDBETWEEN(1,20),\"A\",\"B\",\"C\",\"E\",\"G\",\"H\",\"J\",\"K\",\"L\",\"M\",\"N\",\"O\",\"P\",\"R\",\"S\",\"T\",\"W\",\"X\",\"Y\",\"Z\"),\" \",RANDBETWEEN(1,9),RANDBETWEEN(1,9),\" \",RANDBETWEEN(1,9),RANDBETWEEN(1,9),\" \",RANDBETWEEN(1,9),RANDBETWEEN(1,9),\" \",CHOOSE(RANDBETWEEN(1,4),\"A\",\"B\",\"C\",\"D\"))","v":"RW 82 92 51 B"}]
[{"$f":"INDEX('SYSTEM FORMULAE'!C$2:C$51,RANDBETWEEN(1,50))","v":"Clark"}]
[{"$f":"RANDBETWEEN(7,15)/2","v":4},null,null,"MONTHLY PAY",null,null,null,"               MONTHLY DEDUCTIONS",null,{"$f":"IF(D22=\"\",\"\",3*ROW(G20)+3-J19-J20)","v":21}]
[{"$f":"(RANDBETWEEN(12,100)*10000+RANDBETWEEN(1,9)*1000)/10","v":61800},null,null,null,"Hourly wage","Hours worked","TOTAL",null,"TOTAL",{"$f":"IF(D22=\"\",RANDBETWEEN(ROW(G20),ROW(G20)+1),RANDBETWEEN(ROW(G20),ROW(G20)+2))","v":20}]
[null,null,null,"Basic hours",{"$f":"RANDBETWEEN(430,1200)/50","v":16.54},{"$f":"RANDBETWEEN(40,140)","v":41},{"$f":"E20*F20","v":678.14},"Tax",{"$f":"(G23-VALUE(LEFT(RIGHT(H16,LEN(H16)-1),LEN(RIGHT(H16,LEN(H16)-1))-1)))*0.2","v":65.780000000000015},{"$f":"IF(D22=\"\",IF(J19=ROW(G20),ROW(G20)+1,ROW(G20)),IF(J19=ROW(G20),RANDBETWEEN(ROW(G20)+1,ROW(G20)+2),IF(J19=ROW(G20)+2,RANDBETWEEN(ROW(G20),ROW(G20)+1),CHOOSE(RANDBETWEEN(1,2),ROW(G20),ROW(G20)+2))))","v":22}]
{"$rows_left_out":18}
{"sheet":"SYSTEM FORMULAE","index":2,"n_rows":201,"n_cols":3,"rows_kept":201,"cut":false,"hidden":false,"merged":[]}
["Names","1998 baby names - http://www.statistics.gov.uk/statbase/Product.asp?vlnk=15282"]
["Jack",{"$f":"IF(RAND()<0.97,\"M\",\"N\")","v":"M"},"Smith"]
["Thomas",{"$f":"IF(RAND()<0.97,\"M\",\"N\")","v":"M"},"Wilson"]
["James","M","Jones"]
["Daniel","M","Campbell"]
["Josh","M","Williams"]
["Matthew","M","Brown"]
["Samuel","M","Taylor"]
["Callum","M","Kelly"]
["Joseph","M","Davies"]
["Jordan","M","Johnston"]
["Connor","M","Evans"]
["Ryan","M","Robertson"]
["Luke","M","Moore"]
["William","M","Thomas"]
["Harry","M","Thomson"]
["Ben","M","Roberts"]
["George","M","Johnson"]
["Lewis","M","Smyth"]
["Alexander","M","Lewis"]
{"$rows_left_out":181}